Target
Metabotropic glutamate receptor 7
Ligand
BDBM55081
Substrate
Meas. Tech.
Modulation of the Metabotropic Glutamate Receptor mGluR4: Selectivity at mGluR7
EC50
271082.9765±n/a nM
Citation
 PubChem, PC Modulation of the Metabotropic Glutamate Receptor mGluR4: Selectivity at mGluR7 PubChem Bioassay (2010)[AID] 
Target
Name:
Metabotropic glutamate receptor 7
Synonyms:
GRM7_RAT Grm7 Metabotropic glutamate receptor 7 (mGlu7) mGlu7
Type:
Enzyme
Mol. Mass.:
102244.48
Organism:
Rattus norvegicus (Rat)
Description:
P35400
Residue:
915
  
Inhibitor
Name:
BDBM55081
Synonyms:
ML182 cid_46869947
Type:
Small organic molecule
Emp. Form.:
C21H16ClN3O3
Mol. Mass.:
393.823
SMILES:
[H][C@@]12C[C@@]([H])(C=C1)[C@]1([H])C2C(=O)N(C1=O)c1ccc(NC(=O)c2ccccn2)cc1Cl
: