Target
Metabotropic glutamate receptor 4 [Q124R]
Ligand
BDBM55088
Substrate
Meas. Tech.
Modulation of the Metabotropic Glutamate Receptor mGluR4: Rat PAM Potency
EC50
650±n/a nM
Citation
 PubChem, PC Modulation of the Metabotropic Glutamate Receptor mGluR4: Rat PAM Potency PubChem Bioassay (2010)[AID] 
Target
Name:
Metabotropic glutamate receptor 4 [Q124R]
Synonyms:
GRM4_RAT Grm4 glutamate receptor, metabotropic 4 precursor
Type:
Enzyme Catalytic Domain
Mol. Mass.:
101878.86
Organism:
Rattus norvegicus
Description:
gi_12083595
Residue:
912
  
Inhibitor
Name:
BDBM55088
Synonyms:
N-[4-[(7aS)-1,3-bis(oxidanylidene)-3a,4,5,6,7,7a-hexahydroisoindol-2-yl]-3-chloranyl-phenyl]pyridine-2-carboxamide N-[4-[(7aS)-1,3-dioxo-3a,4,5,6,7,7a-hexahydroisoindol-2-yl]-3-chlorophenyl]-2-pyridinecarboxamide VU0366515-1 | cid_46869945
Type:
Small organic molecule
Emp. Form.:
C20H18ClN3O3
Mol. Mass.:
383.828
SMILES:
Oc1c2CCCCc2c(O)n1-c1ccc(NC(=O)c2ccccn2)cc1Cl
: