Target
M18 aspartyl aminopeptidase
Ligand
BDBM55098
Substrate
Meas. Tech.
QFRET-based biochemical high throughput dose response assay for inhibitors of the Plasmodium falciparum M18 Aspartyl Aminopeptidase (PFM18AAP).
IC50
350.49±n/a nM
Citation
 PubChem, PC QFRET-based biochemical high throughput dose response assay for inhibitors of the Plasmodium falciparum M18 Aspartyl Aminopeptidase (PFM18AAP). PubChem Bioassay (2009)[AID] 
Target
Name:
M18 aspartyl aminopeptidase
Synonyms:
Type:
Enzyme Catalytic Domain
Mol. Mass.:
65642.43
Organism:
Plasmodium falciparum 3D7
Description:
gi_23505220
Residue:
570
  
Inhibitor
Name:
BDBM55098
Synonyms:
(1,3-dioxoisoindol-2-yl)methyl 2-(1H-1,2,4-triazol-5-ylsulfanyl)acetate 2-(1H-1,2,4-triazol-5-ylthio)acetic acid (1,3-dioxo-2-isoindolyl)methyl ester MLS000031579 [1,3-bis(oxidanylidene)isoindol-2-yl]methyl 2-(1H-1,2,4-triazol-5-ylsulfanyl)ethanoate | cid_650854
Type:
Small organic molecule
Emp. Form.:
C13H10N4O4S
Mol. Mass.:
318.308
SMILES:
O=C(CSc1nnc[nH]1)OCN1C(=O)c2ccccc2C1=O
: