Target
M18 aspartyl aminopeptidase
Ligand
BDBM55100
Substrate
Meas. Tech.
QFRET-based biochemical high throughput dose response assay for inhibitors of the Plasmodium falciparum M18 Aspartyl Aminopeptidase (PFM18AAP).
IC50
2549±n/a nM
Citation
 PubChem, PC QFRET-based biochemical high throughput dose response assay for inhibitors of the Plasmodium falciparum M18 Aspartyl Aminopeptidase (PFM18AAP). PubChem Bioassay (2009)[AID] 
Target
Name:
M18 aspartyl aminopeptidase
Synonyms:
Type:
Enzyme Catalytic Domain
Mol. Mass.:
65642.43
Organism:
Plasmodium falciparum 3D7
Description:
gi_23505220
Residue:
570
  
Inhibitor
Name:
BDBM55100
Synonyms:
2-(4-bromanyl-3-methyl-phenoxy)-N-(1,2,4-triazol-4-yl)ethanamide 2-(4-bromo-3-methylphenoxy)-N-(1,2,4-triazol-4-yl)acetamide SMR000036894 | cid_660879
Type:
Small organic molecule
Emp. Form.:
C11H11BrN4O2
Mol. Mass.:
311.135
SMILES:
Cc1cc(OCC(=O)Nn2cnnc2)ccc1Br
: