Target
M18 aspartyl aminopeptidase
Ligand
BDBM41221
Substrate
Meas. Tech.
QFRET-based biochemical high throughput dose response assay for inhibitors of the Plasmodium falciparum M18 Aspartyl Aminopeptidase (PFM18AAP).
IC50
2246±n/a nM
Citation
 PubChem, PC QFRET-based biochemical high throughput dose response assay for inhibitors of the Plasmodium falciparum M18 Aspartyl Aminopeptidase (PFM18AAP). PubChem Bioassay (2009)[AID] 
Target
Name:
M18 aspartyl aminopeptidase
Synonyms:
Type:
Enzyme Catalytic Domain
Mol. Mass.:
65642.43
Organism:
Plasmodium falciparum 3D7
Description:
gi_23505220
Residue:
570
  
Inhibitor
Name:
BDBM41221
Synonyms:
2-amino-4-butan-2-ylphenol 2-azanyl-4-butan-2-yl-phenol SMR000043838 | cid_100028
Type:
Small organic molecule
Emp. Form.:
C10H15NO
Mol. Mass.:
165.2322
SMILES:
CCC(C)c1ccc(O)c(N)c1
: