Target
M18 aspartyl aminopeptidase
Ligand
BDBM39612
Substrate
Meas. Tech.
QFRET-based biochemical high throughput dose response assay for inhibitors of the Plasmodium falciparum M18 Aspartyl Aminopeptidase (PFM18AAP).
IC50
1457±n/a nM
Citation
 PubChem, PC QFRET-based biochemical high throughput dose response assay for inhibitors of the Plasmodium falciparum M18 Aspartyl Aminopeptidase (PFM18AAP). PubChem Bioassay (2009)[AID] 
Target
Name:
M18 aspartyl aminopeptidase
Synonyms:
Type:
Enzyme Catalytic Domain
Mol. Mass.:
65642.43
Organism:
Plasmodium falciparum 3D7
Description:
gi_23505220
Residue:
570
  
Inhibitor
Name:
BDBM39612
Synonyms:
2-[2-(3,4-dihydroxyphenyl)-2-oxoethyl]sulfanyl-1H-quinazolin-4-one 2-[[2-(3,4-dihydroxyphenyl)-2-keto-ethyl]thio]-1H-quinazolin-4-one 2-{[2-(3,4-dihydroxyphenyl)-2-oxoethyl]thio}quinazolin-4(3H)-one MLS000089953 cid_706562
Type:
Small organic molecule
Emp. Form.:
C16H12N2O4S
Mol. Mass.:
328.342
SMILES:
Oc1ccc(cc1O)C(=O)CSc1nc2ccccc2c(=O)[nH]1
: