Target
M18 aspartyl aminopeptidase
Ligand
BDBM55113
Substrate
Meas. Tech.
QFRET-based biochemical high throughput dose response assay for inhibitors of the Plasmodium falciparum M18 Aspartyl Aminopeptidase (PFM18AAP).
IC50
2168±n/a nM
Citation
 PubChem, PC QFRET-based biochemical high throughput dose response assay for inhibitors of the Plasmodium falciparum M18 Aspartyl Aminopeptidase (PFM18AAP). PubChem Bioassay (2009)[AID] 
Target
Name:
M18 aspartyl aminopeptidase
Synonyms:
Type:
Enzyme Catalytic Domain
Mol. Mass.:
65642.43
Organism:
Plasmodium falciparum 3D7
Description:
gi_23505220
Residue:
570
  
Inhibitor
Name:
BDBM55113
Synonyms:
MLS000051704 N-(1,2,4-triazol-4-yl)benzothiophene-3-carboxamide SMR000080507 | cid_1246153
Type:
Small organic molecule
Emp. Form.:
C11H8N4OS
Mol. Mass.:
244.272
SMILES:
O=C(Nn1cnnc1)c1csc2ccccc12
: