Target
M18 aspartyl aminopeptidase
Ligand
BDBM55120
Substrate
Meas. Tech.
QFRET-based biochemical high throughput dose response assay for inhibitors of the Plasmodium falciparum M18 Aspartyl Aminopeptidase (PFM18AAP).
IC50
2346±n/a nM
Citation
 PubChem, PC QFRET-based biochemical high throughput dose response assay for inhibitors of the Plasmodium falciparum M18 Aspartyl Aminopeptidase (PFM18AAP). PubChem Bioassay (2009)[AID] 
Target
Name:
M18 aspartyl aminopeptidase
Synonyms:
Type:
Enzyme Catalytic Domain
Mol. Mass.:
65642.43
Organism:
Plasmodium falciparum 3D7
Description:
gi_23505220
Residue:
570
  
Inhibitor
Name:
BDBM55120
Synonyms:
(6E)-4-bromanyl-2-methoxy-6-[(1H-1,2,4-triazol-5-ylamino)methylidene]cyclohexa-2,4-dien-1-one (6E)-4-bromo-2-methoxy-6-[(1H-1,2,4-triazol-5-ylamino)methylidene]-1-cyclohexa-2,4-dienone MLS000106281 cid_5338969
Type:
Small organic molecule
Emp. Form.:
C10H9BrN4O2
Mol. Mass.:
297.108
SMILES:
COc1cc(Br)cc(C=Nc2nnc[nH]2)c1O
: