Target
M18 aspartyl aminopeptidase
Ligand
BDBM55136
Substrate
Meas. Tech.
QFRET-based biochemical high throughput dose response assay for inhibitors of the Plasmodium falciparum M18 Aspartyl Aminopeptidase (PFM18AAP).
IC50
1896±n/a nM
Citation
 PubChem, PC QFRET-based biochemical high throughput dose response assay for inhibitors of the Plasmodium falciparum M18 Aspartyl Aminopeptidase (PFM18AAP). PubChem Bioassay (2009)[AID] 
Target
Name:
M18 aspartyl aminopeptidase
Synonyms:
Type:
Enzyme Catalytic Domain
Mol. Mass.:
65642.43
Organism:
Plasmodium falciparum 3D7
Description:
gi_23505220
Residue:
570
  
Inhibitor
Name:
BDBM55136
Synonyms:
1-(2,3-dimethylphenyl)-3-(1,2,4-triazol-4-yl)thiourea N-(2,3-dimethylphenyl)-N'-4H-1,2,4-triazol-4-ylthiourea cid_715993
Type:
Small organic molecule
Emp. Form.:
C11H13N5S
Mol. Mass.:
247.319
SMILES:
Cc1cccc(NC(=S)Nn2cnnc2)c1C
: