Target
M18 aspartyl aminopeptidase
Ligand
BDBM55143
Substrate
Meas. Tech.
QFRET-based biochemical high throughput dose response assay for inhibitors of the Plasmodium falciparum M18 Aspartyl Aminopeptidase (PFM18AAP).
IC50
2080±n/a nM
Citation
 PubChem, PC QFRET-based biochemical high throughput dose response assay for inhibitors of the Plasmodium falciparum M18 Aspartyl Aminopeptidase (PFM18AAP). PubChem Bioassay (2009)[AID] 
Target
Name:
M18 aspartyl aminopeptidase
Synonyms:
Type:
Enzyme Catalytic Domain
Mol. Mass.:
65642.43
Organism:
Plasmodium falciparum 3D7
Description:
gi_23505220
Residue:
570
  
Inhibitor
Name:
BDBM55143
Synonyms:
2,3-dimethoxy-N-(1,2,4-triazol-4-ylcarbamothioyl)benzamide 2,3-dimethoxy-N-[sulfanylidene-(1,2,4-triazol-4-ylamino)methyl]benzamide SMR000385534 | cid_4027510
Type:
Small organic molecule
Emp. Form.:
C12H13N5O3S
Mol. Mass.:
307.328
SMILES:
COc1cccc(C(=O)NC(=S)Nn2cnnc2)c1OC
: