Target
M18 aspartyl aminopeptidase
Ligand
BDBM55144
Substrate
Meas. Tech.
QFRET-based biochemical high throughput dose response assay for inhibitors of the Plasmodium falciparum M18 Aspartyl Aminopeptidase (PFM18AAP).
IC50
1566±n/a nM
Citation
 PubChem, PC QFRET-based biochemical high throughput dose response assay for inhibitors of the Plasmodium falciparum M18 Aspartyl Aminopeptidase (PFM18AAP). PubChem Bioassay (2009)[AID] 
Target
Name:
M18 aspartyl aminopeptidase
Synonyms:
Type:
Enzyme Catalytic Domain
Mol. Mass.:
65642.43
Organism:
Plasmodium falciparum 3D7
Description:
gi_23505220
Residue:
570
  
Inhibitor
Name:
BDBM55144
Synonyms:
4-chloranyl-N'-(6-methyl-5-oxidanylidene-2H-1,2,4-triazin-3-yl)benzenesulfonohydrazide 4-chloro-N'-(6-methyl-5-oxo-2H-1,2,4-triazin-3-yl)benzenesulfonohydrazide SMR000372652 | cid_2405773
Type:
Small organic molecule
Emp. Form.:
C10H10ClN5O3S
Mol. Mass.:
315.736
SMILES:
Cc1nnc(NNS(=O)(=O)c2ccc(Cl)cc2)[nH]c1=O
: