Target
M18 aspartyl aminopeptidase
Ligand
BDBM55148
Substrate
Meas. Tech.
QFRET-based biochemical high throughput dose response assay for inhibitors of the Plasmodium falciparum M18 Aspartyl Aminopeptidase (PFM18AAP).
IC50
1671±n/a nM
Citation
 PubChem, PC QFRET-based biochemical high throughput dose response assay for inhibitors of the Plasmodium falciparum M18 Aspartyl Aminopeptidase (PFM18AAP). PubChem Bioassay (2009)[AID] 
Target
Name:
M18 aspartyl aminopeptidase
Synonyms:
Type:
Enzyme Catalytic Domain
Mol. Mass.:
65642.43
Organism:
Plasmodium falciparum 3D7
Description:
gi_23505220
Residue:
570
  
Inhibitor
Name:
BDBM55148
Synonyms:
5-(1H-indol-2-ylmethylene)-2-thioxo-hexahydropyrimidine-4,6-quinone 5-(1H-indol-2-ylmethylidene)-2-sulfanylidene-1,3-diazinane-4,6-dione SMR000495894 | cid_5511942
Type:
Small organic molecule
Emp. Form.:
C13H9N3O2S
Mol. Mass.:
271.294
SMILES:
O=C1NC(=S)NC(=O)C1=Cc1cc2ccccc2[nH]1
: