Target
M18 aspartyl aminopeptidase
Ligand
BDBM55149
Substrate
Meas. Tech.
QFRET-based biochemical high throughput dose response assay for inhibitors of the Plasmodium falciparum M18 Aspartyl Aminopeptidase (PFM18AAP).
IC50
2367±n/a nM
Citation
 PubChem, PC QFRET-based biochemical high throughput dose response assay for inhibitors of the Plasmodium falciparum M18 Aspartyl Aminopeptidase (PFM18AAP). PubChem Bioassay (2009)[AID] 
Target
Name:
M18 aspartyl aminopeptidase
Synonyms:
Type:
Enzyme Catalytic Domain
Mol. Mass.:
65642.43
Organism:
Plasmodium falciparum 3D7
Description:
gi_23505220
Residue:
570
  
Inhibitor
Name:
BDBM55149
Synonyms:
3-nitro-5-(1,2,4-triazol-4-ylcarbamoyl)benzoic acid methyl ester MLS001185466 cid_1279661 | methyl 3-nitro-5-(1,2,4-triazol-4-ylcarbamoyl)benzoate
Type:
Small organic molecule
Emp. Form.:
C11H9N5O5
Mol. Mass.:
291.2197
SMILES:
COC(=O)c1cc(cc(c1)[N+]([O-])=O)C(=O)Nn1cnnc1
: