Target
M18 aspartyl aminopeptidase
Ligand
BDBM55159
Substrate
Meas. Tech.
QFRET-based biochemical high throughput dose response assay for inhibitors of the Plasmodium falciparum M18 Aspartyl Aminopeptidase (PFM18AAP).
IC50
602.9±n/a nM
Citation
 PubChem, PC QFRET-based biochemical high throughput dose response assay for inhibitors of the Plasmodium falciparum M18 Aspartyl Aminopeptidase (PFM18AAP). PubChem Bioassay (2009)[AID] 
Target
Name:
M18 aspartyl aminopeptidase
Synonyms:
Type:
Enzyme Catalytic Domain
Mol. Mass.:
65642.43
Organism:
Plasmodium falciparum 3D7
Description:
gi_23505220
Residue:
570
  
Inhibitor
Name:
BDBM55159
Synonyms:
MLS001170871 cid_16242656 oxalic acid;1-phenyl-2-(1,2,4-triazol-4-yl)ethanol
Type:
Small organic molecule
Emp. Form.:
C10H11N3O
Mol. Mass.:
189.2138
SMILES:
OC(Cn1cnnc1)c1ccccc1
: