Target
M18 aspartyl aminopeptidase
Ligand
BDBM55162
Substrate
Meas. Tech.
QFRET-based biochemical high throughput dose response assay for inhibitors of the Plasmodium falciparum M18 Aspartyl Aminopeptidase (PFM18AAP).
IC50
1467±n/a nM
Citation
 PubChem, PC QFRET-based biochemical high throughput dose response assay for inhibitors of the Plasmodium falciparum M18 Aspartyl Aminopeptidase (PFM18AAP). PubChem Bioassay (2009)[AID] 
Target
Name:
M18 aspartyl aminopeptidase
Synonyms:
Type:
Enzyme Catalytic Domain
Mol. Mass.:
65642.43
Organism:
Plasmodium falciparum 3D7
Description:
gi_23505220
Residue:
570
  
Inhibitor
Name:
BDBM55162
Synonyms:
1-(2-chlorophenyl)-3-(1,2,4-triazol-4-yl)urea SMR000678322 | cid_18807511
Type:
Small organic molecule
Emp. Form.:
C9H8ClN5O
Mol. Mass.:
237.646
SMILES:
Clc1ccccc1NC(=O)Nn1cnnc1
: