Target
M18 aspartyl aminopeptidase
Ligand
BDBM55171
Substrate
Meas. Tech.
QFRET-based biochemical high throughput dose response assay for inhibitors of the Plasmodium falciparum M18 Aspartyl Aminopeptidase (PFM18AAP).
IC50
2512±n/a nM
Citation
 PubChem, PC QFRET-based biochemical high throughput dose response assay for inhibitors of the Plasmodium falciparum M18 Aspartyl Aminopeptidase (PFM18AAP). PubChem Bioassay (2009)[AID] 
Target
Name:
M18 aspartyl aminopeptidase
Synonyms:
Type:
Enzyme Catalytic Domain
Mol. Mass.:
65642.43
Organism:
Plasmodium falciparum 3D7
Description:
gi_23505220
Residue:
570
  
Inhibitor
Name:
BDBM55171
Synonyms:
1-[3-(3,4-dihydroxyphenyl)propanoylamino]-3-(3,4-dimethoxyphenyl)urea 1-[[3-(3,4-dihydroxyphenyl)-1-oxopropyl]amino]-3-(3,4-dimethoxyphenyl)urea SMR000679453 | cid_1294840
Type:
Small organic molecule
Emp. Form.:
C18H21N3O6
Mol. Mass.:
375.3758
SMILES:
COc1ccc(NC(=O)NNC(=O)CCc2ccc(O)c(O)c2)cc1OC
: