Target
Procathepsin L
Ligand
BDBM55103
Substrate
Meas. Tech.
QFRET-based counterscreen for inhibitors of PFM18AAP: biochemical high throughput dose response assay for inhibitors of the Cathepsin L proteinase (CTSL1).
IC50
>59642±n/a nM
Citation
 PubChem, PC QFRET-based counterscreen for inhibitors of PFM18AAP: biochemical high throughput dose response assay for inhibitors of the Cathepsin L proteinase (CTSL1). PubChem Bioassay (2009)[AID] 
Target
Name:
Procathepsin L
Synonyms:
CATL1_HUMAN CTSL CTSL1 Cathepsin L Cathepsin L1 heavy chain MEP cathepsin L preproprotein
Type:
Enzyme
Mol. Mass.:
37557.19
Organism:
Homo sapiens (Human)
Description:
Purchased from Calbiochem (San Diego, CA).
Residue:
333
  
Inhibitor
Name:
BDBM55103
Synonyms:
2-[(4-phenyl-5-sulfanylidene-1,3,4-thiadiazol-2-yl)sulfanyl]-N-(1,2,4-triazol-4-yl)acetamide 2-[(4-phenyl-5-sulfanylidene-1,3,4-thiadiazol-2-yl)thio]-N-(1,2,4-triazol-4-yl)acetamide MLS000089307 cid_1851980
Type:
Small organic molecule
Emp. Form.:
C12H10N6OS3
Mol. Mass.:
350.442
SMILES:
O=C(CSc1nn(-c2ccccc2)c(=S)s1)Nn1cnnc1
: