Target
Procathepsin L
Ligand
BDBM34340
Substrate
Meas. Tech.
QFRET-based counterscreen for inhibitors of PFM18AAP: biochemical high throughput dose response assay for inhibitors of the Cathepsin L proteinase (CTSL1).
IC50
>59642±n/a nM
Citation
 PubChem, PC QFRET-based counterscreen for inhibitors of PFM18AAP: biochemical high throughput dose response assay for inhibitors of the Cathepsin L proteinase (CTSL1). PubChem Bioassay (2009)[AID] 
Target
Name:
Procathepsin L
Synonyms:
CATL1_HUMAN CTSL CTSL1 Cathepsin L Cathepsin L1 heavy chain MEP cathepsin L preproprotein
Type:
Enzyme
Mol. Mass.:
37557.19
Organism:
Homo sapiens (Human)
Description:
Purchased from Calbiochem (San Diego, CA).
Residue:
333
  
Inhibitor
Name:
BDBM34340
Synonyms:
2-(4-methyl-3-piperidin-1-ylsulfonyl-phenyl)-1,2-benzothiazol-3-one 2-(4-methyl-3-piperidinosulfonyl-phenyl)-1,2-benzothiazol-3-one MLS000057572 cid_2327953
Type:
Small organic molecule
Emp. Form.:
C19H20N2O3S2
Mol. Mass.:
388.504
SMILES:
Cc1ccc(cc1S(=O)(=O)N1CCCCC1)-n1sc2ccccc2c1=O
: