Target
Procathepsin L
Ligand
BDBM55111
Substrate
Meas. Tech.
QFRET-based counterscreen for inhibitors of PFM18AAP: biochemical high throughput dose response assay for inhibitors of the Cathepsin L proteinase (CTSL1).
IC50
>59642±n/a nM
Citation
 PubChem, PC QFRET-based counterscreen for inhibitors of PFM18AAP: biochemical high throughput dose response assay for inhibitors of the Cathepsin L proteinase (CTSL1). PubChem Bioassay (2009)[AID] 
Target
Name:
Procathepsin L
Synonyms:
CATL1_HUMAN CTSL CTSL1 Cathepsin L Cathepsin L1 heavy chain MEP cathepsin L preproprotein
Type:
Enzyme
Mol. Mass.:
37557.19
Organism:
Homo sapiens (Human)
Description:
Purchased from Calbiochem (San Diego, CA).
Residue:
333
  
Inhibitor
Name:
BDBM55111
Synonyms:
2-phenyl-N-(1,2,4-triazol-4-yl)benzamide N-4H-1,2,4-triazol-4-yl-2-biphenylcarboxamide cid_976233
Type:
Small organic molecule
Emp. Form.:
C15H12N4O
Mol. Mass.:
264.282
SMILES:
O=C(Nn1cnnc1)c1ccccc1-c1ccccc1
: