Target
Procathepsin L
Ligand
BDBM34849
Substrate
Meas. Tech.
QFRET-based counterscreen for inhibitors of PFM18AAP: biochemical high throughput dose response assay for inhibitors of the Cathepsin L proteinase (CTSL1).
IC50
>59642±n/a nM
Citation
 PubChem, PC QFRET-based counterscreen for inhibitors of PFM18AAP: biochemical high throughput dose response assay for inhibitors of the Cathepsin L proteinase (CTSL1). PubChem Bioassay (2009)[AID] 
Target
Name:
Procathepsin L
Synonyms:
CATL1_HUMAN CTSL CTSL1 Cathepsin L Cathepsin L1 heavy chain MEP cathepsin L preproprotein
Type:
Enzyme
Mol. Mass.:
37557.19
Organism:
Homo sapiens (Human)
Description:
Purchased from Calbiochem (San Diego, CA).
Residue:
333
  
Inhibitor
Name:
BDBM34849
Synonyms:
6-fluoranyl-2-(2-methylphenyl)-1,2-benzothiazol-3-one 6-fluoro-2-(2-methylphenyl)-1,2-benzothiazol-3-one MLS000729299 cid_1510379
Type:
Small organic molecule
Emp. Form.:
C14H10FNOS
Mol. Mass.:
259.299
SMILES:
Cc1ccccc1-n1sc2cc(F)ccc2c1=O
: