Target
Procathepsin L
Ligand
BDBM55138
Substrate
Meas. Tech.
QFRET-based counterscreen for inhibitors of PFM18AAP: biochemical high throughput dose response assay for inhibitors of the Cathepsin L proteinase (CTSL1).
IC50
>59642±n/a nM
Citation
 PubChem, PC QFRET-based counterscreen for inhibitors of PFM18AAP: biochemical high throughput dose response assay for inhibitors of the Cathepsin L proteinase (CTSL1). PubChem Bioassay (2009)[AID] 
Target
Name:
Procathepsin L
Synonyms:
CATL1_HUMAN CTSL CTSL1 Cathepsin L Cathepsin L1 heavy chain MEP cathepsin L preproprotein
Type:
Enzyme
Mol. Mass.:
37557.19
Organism:
Homo sapiens (Human)
Description:
Purchased from Calbiochem (San Diego, CA).
Residue:
333
  
Inhibitor
Name:
BDBM55138
Synonyms:
(6E)-4-bromanyl-6-[[(5-tert-butyl-2-oxidanyl-phenyl)amino]methylidene]cyclohexa-2,4-dien-1-one (6E)-4-bromo-6-[(5-tert-butyl-2-hydroxyanilino)methylidene]-1-cyclohexa-2,4-dienone MLS000714154 cid_5409880
Type:
Small organic molecule
Emp. Form.:
C17H18BrNO2
Mol. Mass.:
348.234
SMILES:
CC(C)(C)c1ccc(O)c(c1)N=Cc1cc(Br)ccc1O
: