Target
Procathepsin L
Ligand
BDBM55139
Substrate
Meas. Tech.
QFRET-based counterscreen for inhibitors of PFM18AAP: biochemical high throughput dose response assay for inhibitors of the Cathepsin L proteinase (CTSL1).
IC50
>59642±n/a nM
Citation
 PubChem, PC QFRET-based counterscreen for inhibitors of PFM18AAP: biochemical high throughput dose response assay for inhibitors of the Cathepsin L proteinase (CTSL1). PubChem Bioassay (2009)[AID] 
Target
Name:
Procathepsin L
Synonyms:
CATL1_HUMAN CTSL CTSL1 Cathepsin L Cathepsin L1 heavy chain MEP cathepsin L preproprotein
Type:
Enzyme
Mol. Mass.:
37557.19
Organism:
Homo sapiens (Human)
Description:
Purchased from Calbiochem (San Diego, CA).
Residue:
333
  
Inhibitor
Name:
BDBM55139
Synonyms:
(4Z)-4-[[3-(4-fluorophenyl)-1-phenyl-4-pyrazolyl]methylidene]-3-methyl-1H-pyrazol-5-one (4Z)-4-[[3-(4-fluorophenyl)-1-phenyl-pyrazol-4-yl]methylidene]-3-methyl-1H-pyrazol-5-one 4-{[3-(4-fluorophenyl)-1-phenyl-1H-pyrazol-4-yl]methylene}-5-methyl-2,4-dihydro-3H-pyrazol-3-one SMR000267633 | cid_5337366
Type:
Small organic molecule
Emp. Form.:
C20H15FN4O
Mol. Mass.:
346.3577
SMILES:
Fc1ccc(cc1)-c1nn(cc1C=c1c(=C)[nH][nH]c1=O)-c1ccccc1
: