Target
Procathepsin L
Ligand
BDBM55142
Substrate
Meas. Tech.
QFRET-based counterscreen for inhibitors of PFM18AAP: biochemical high throughput dose response assay for inhibitors of the Cathepsin L proteinase (CTSL1).
IC50
>59642±n/a nM
Citation
 PubChem, PC QFRET-based counterscreen for inhibitors of PFM18AAP: biochemical high throughput dose response assay for inhibitors of the Cathepsin L proteinase (CTSL1). PubChem Bioassay (2009)[AID] 
Target
Name:
Procathepsin L
Synonyms:
CATL1_HUMAN CTSL CTSL1 Cathepsin L Cathepsin L1 heavy chain MEP cathepsin L preproprotein
Type:
Enzyme
Mol. Mass.:
37557.19
Organism:
Homo sapiens (Human)
Description:
Purchased from Calbiochem (San Diego, CA).
Residue:
333
  
Inhibitor
Name:
BDBM55142
Synonyms:
3-nitro-4-(1H-1,2,4-triazol-5-ylthio)benzoic acid [2-(carbethoxyamino)-2-keto-ethyl] ester MLS001004551 [2-(ethoxycarbonylamino)-2-oxidanylidene-ethyl] 3-nitro-4-(1H-1,2,4-triazol-5-ylsulfanyl)benzoate cid_2083851
Type:
Small organic molecule
Emp. Form.:
C14H13N5O7S
Mol. Mass.:
395.347
SMILES:
CCOC(=O)NC(=O)COC(=O)c1ccc(Sc2nnc[nH]2)c(c1)[N+]([O-])=O
: