Target
Procathepsin L
Ligand
BDBM55162
Substrate
Meas. Tech.
QFRET-based counterscreen for inhibitors of PFM18AAP: biochemical high throughput dose response assay for inhibitors of the Cathepsin L proteinase (CTSL1).
IC50
>59642±n/a nM
Citation
 PubChem, PC QFRET-based counterscreen for inhibitors of PFM18AAP: biochemical high throughput dose response assay for inhibitors of the Cathepsin L proteinase (CTSL1). PubChem Bioassay (2009)[AID] 
Target
Name:
Procathepsin L
Synonyms:
CATL1_HUMAN CTSL CTSL1 Cathepsin L Cathepsin L1 heavy chain MEP cathepsin L preproprotein
Type:
Enzyme
Mol. Mass.:
37557.19
Organism:
Homo sapiens (Human)
Description:
Purchased from Calbiochem (San Diego, CA).
Residue:
333
  
Inhibitor
Name:
BDBM55162
Synonyms:
1-(2-chlorophenyl)-3-(1,2,4-triazol-4-yl)urea SMR000678322 | cid_18807511
Type:
Small organic molecule
Emp. Form.:
C9H8ClN5O
Mol. Mass.:
237.646
SMILES:
Clc1ccccc1NC(=O)Nn1cnnc1
: