Target
Procathepsin L
Ligand
BDBM55167
Substrate
Meas. Tech.
QFRET-based counterscreen for inhibitors of PFM18AAP: biochemical high throughput dose response assay for inhibitors of the Cathepsin L proteinase (CTSL1).
IC50
>59642±n/a nM
Citation
 PubChem, PC QFRET-based counterscreen for inhibitors of PFM18AAP: biochemical high throughput dose response assay for inhibitors of the Cathepsin L proteinase (CTSL1). PubChem Bioassay (2009)[AID] 
Target
Name:
Procathepsin L
Synonyms:
CATL1_HUMAN CTSL CTSL1 Cathepsin L Cathepsin L1 heavy chain MEP cathepsin L preproprotein
Type:
Enzyme
Mol. Mass.:
37557.19
Organism:
Homo sapiens (Human)
Description:
Purchased from Calbiochem (San Diego, CA).
Residue:
333
  
Inhibitor
Name:
BDBM55167
Synonyms:
1-(5-chloranyl-2-methyl-phenyl)-3-(1,2,4-triazol-4-yl)thiourea 1-(5-chloro-2-methylphenyl)-3-(1,2,4-triazol-4-yl)thiourea SMR000678568 | cid_19687016
Type:
Small organic molecule
Emp. Form.:
C10H10ClN5S
Mol. Mass.:
267.738
SMILES:
Cc1ccc(Cl)cc1NC(=S)Nn1cnnc1
: