Target
Procathepsin L
Ligand
BDBM55182
Substrate
Meas. Tech.
QFRET-based counterscreen for inhibitors of PFM18AAP: biochemical high throughput dose response assay for inhibitors of the Cathepsin L proteinase (CTSL1).
IC50
>59642±n/a nM
Citation
 PubChem, PC QFRET-based counterscreen for inhibitors of PFM18AAP: biochemical high throughput dose response assay for inhibitors of the Cathepsin L proteinase (CTSL1). PubChem Bioassay (2009)[AID] 
Target
Name:
Procathepsin L
Synonyms:
CATL1_HUMAN CTSL CTSL1 Cathepsin L Cathepsin L1 heavy chain MEP cathepsin L preproprotein
Type:
Enzyme
Mol. Mass.:
37557.19
Organism:
Homo sapiens (Human)
Description:
Purchased from Calbiochem (San Diego, CA).
Residue:
333
  
Inhibitor
Name:
BDBM55182
Synonyms:
5-[[5-(4-fluoranyl-2-oxidanyl-phenyl)furan-2-yl]methylidene]-1,3-diazinane-2,4,6-trione 5-[[5-(4-fluoro-2-hydroxyphenyl)-2-furanyl]methylidene]-1,3-diazinane-2,4,6-trione MLS000911621 cid_24856274
Type:
Small organic molecule
Emp. Form.:
C15H9FN2O5
Mol. Mass.:
316.2408
SMILES:
[#8]-c1cc(F)ccc1-c1ccc(\[#6]=[#6]-2/[#6](=O)-[#7]-[#6](=O)-[#7]-[#6]-2=O)o1
: