Target
Metabotropic glutamate receptor 4
Ligand
BDBM50293732
Substrate
Meas. Tech.
Modulation of the Metabotropic Glutamate Receptor mGluR4: Potency at human mGluR4
EC50
1370±n/a nM
Citation
 PubChem, PC Modulation of the Metabotropic Glutamate Receptor mGluR4: Potency at human mGluR4 PubChem Bioassay (2010)[AID] 
Target
Name:
Metabotropic glutamate receptor 4
Synonyms:
GPRC1D GRM4_HUMAN MGLUR4 Metabotropic glutamate receptor 4 (mGlu4) metabotropic glutamate 4
Type:
Protein
Mol. Mass.:
101899.95
Organism:
Homo sapiens (Human)
Description:
Q14833
Residue:
912
  
Inhibitor
Name:
BDBM50293732
Synonyms:
CHEMBL549330 cid_4644726
Type:
Small organic molecule
Emp. Form.:
C12H8Cl2N2O
Mol. Mass.:
267.111
SMILES:
Clc1ccc(NC(=O)c2ccccn2)cc1Cl
: