Target
Neutrophil cytosol factor 1 [S99G]
Ligand
BDBM55375
Substrate
Meas. Tech.
Dose Response Confirmation for small molecular inhibitors for p47phox, a regulatory protein of NADPH oxidases (Noxs)
IC50
3100±n/a nM
Citation
 PubChem, PC Dose Response Confirmation for small molecular inhibitors for p47phox, a regulatory protein of NADPH oxidases (Noxs) PubChem Bioassay (2008)[AID] 
Target
Name:
Neutrophil cytosol factor 1 [S99G]
Synonyms:
NCF1 NOXO2 neutrophil cytosolic factor 1
Type:
Enzyme Catalytic Domain
Mol. Mass.:
44664.39
Organism:
Homo sapiens (Human)
Description:
gi_115298672
Residue:
390
  
Inhibitor
Name:
BDBM55375
Synonyms:
(4E)-4-[4-(dimethylamino)benzylidene]-5-phenyl-2-[4-(p-tolyl)thiazol-2-yl]-2-pyrazolin-3-one (4E)-4-[[4-(dimethylamino)phenyl]methylidene]-2-[4-(4-methylphenyl)-1,3-thiazol-2-yl]-5-phenylpyrazol-3-one 4-(4-Dimethylamino-benzylidene)-5-phenyl-2-(4-p-tolyl-thiazol-2-yl)-2,4-dihydro-pyrazol-3-one SMR000122164 | cid_5342321
Type:
Small organic molecule
Emp. Form.:
C28H24N4OS
Mol. Mass.:
464.581
SMILES:
CN(C)c1ccc(\C=C2\C(=O)N(N=C2c2ccccc2)c2nc(cs2)-c2ccc(C)cc2)cc1
: