Target
Neutrophil cytosol factor 1 [S99G]
Ligand
BDBM39715
Substrate
Meas. Tech.
Dose Response Confirmation for small molecular inhibitors for p47phox, a regulatory protein of NADPH oxidases (Noxs)
IC50
1800±n/a nM
Citation
 PubChem, PC Dose Response Confirmation for small molecular inhibitors for p47phox, a regulatory protein of NADPH oxidases (Noxs) PubChem Bioassay (2008)[AID] 
Target
Name:
Neutrophil cytosol factor 1 [S99G]
Synonyms:
NCF1 NOXO2 neutrophil cytosolic factor 1
Type:
Enzyme Catalytic Domain
Mol. Mass.:
44664.39
Organism:
Homo sapiens (Human)
Description:
gi_115298672
Residue:
390
  
Inhibitor
Name:
BDBM39715
Synonyms:
(4E)-2-(4-fluorophenyl)-4-[(2Z)-2-(1,3,3-trimethyl-2-indolylidene)ethylidene]-5-oxazolone (4E)-2-(4-fluorophenyl)-4-[(2Z)-2-(1,3,3-trimethylindolin-2-ylidene)ethylidene]-2-oxazolin-5-one SMR000153968 | cid_2557934
Type:
Small organic molecule
Emp. Form.:
C22H19FN2O2
Mol. Mass.:
362.3969
SMILES:
CN1\C(=C/C=C2/N=C(OC2=O)c2ccc(F)cc2)C(C)(C)c2ccccc12
: