Target
Neutrophil cytosol factor 1 [S99G]
Ligand
BDBM50094893
Substrate
Meas. Tech.
Dose Response Confirmation for small molecular inhibitors for p47phox, a regulatory protein of NADPH oxidases (Noxs)
IC50
390±n/a nM
Citation
 PubChem, PC Dose Response Confirmation for small molecular inhibitors for p47phox, a regulatory protein of NADPH oxidases (Noxs) PubChem Bioassay (2008)[AID] 
Target
Name:
Neutrophil cytosol factor 1 [S99G]
Synonyms:
NCF1 NOXO2 neutrophil cytosolic factor 1
Type:
Enzyme Catalytic Domain
Mol. Mass.:
44664.39
Organism:
Homo sapiens (Human)
Description:
gi_115298672
Residue:
390
  
Inhibitor
Name:
BDBM50094893
Synonyms:
1-Amino-4-hydroxy-anthraquinone CHEMBL88326 | cid_8323
Type:
Small organic molecule
Emp. Form.:
C14H9NO3
Mol. Mass.:
239.2262
SMILES:
Nc1ccc(O)c2C(=O)c3ccccc3C(=O)c12
: