Target
Kallikrein-5
Ligand
BDBM33453
Substrate
Meas. Tech.
Kallikrein 5 1536 HTS Dose Response Confirmation
IC50
1486.99±n/a nM
Citation
 PubChem, PC Kallikrein 5 1536 HTS Dose Response Confirmation PubChem Bioassay (2008)[AID] 
Target
Name:
Kallikrein-5
Synonyms:
KLK5 Kallikrein 5 kallikrein-related peptidase 5 preproprotein
Type:
PROTEIN
Mol. Mass.:
32031.72
Organism:
Homo sapiens (Human)
Description:
EBI_12584
Residue:
293
  
Inhibitor
Name:
BDBM33453
Synonyms:
(3-Amino-[1,2,4]triazol-4-yl)-(4-methoxy-phenyl)-methanone (3-azanyl-1,2,4-triazol-4-yl)-(4-methoxyphenyl)methanone SMR000121258 | cid_2938648
Type:
Small organic molecule
Emp. Form.:
C10H10N4O2
Mol. Mass.:
218.212
SMILES:
COc1ccc(cc1)C(=O)n1cnnc1N
: