Target
Kallikrein-5
Ligand
BDBM32709
Substrate
Meas. Tech.
Kallikrein 5 1536 HTS Dose Response Confirmation
IC50
408.45±n/a nM
Citation
 PubChem, PC Kallikrein 5 1536 HTS Dose Response Confirmation PubChem Bioassay (2008)[AID] 
Target
Name:
Kallikrein-5
Synonyms:
KLK5 Kallikrein 5 kallikrein-related peptidase 5 preproprotein
Type:
PROTEIN
Mol. Mass.:
32031.72
Organism:
Homo sapiens (Human)
Description:
EBI_12584
Residue:
293
  
Inhibitor
Name:
BDBM32709
Synonyms:
(5-amino-3-pyridin-3-yl-1,2,4-triazol-1-yl)-(4-methylphenyl)methanone 1-(4-methylbenzoyl)-3-(3-pyridinyl)-1H-1,2,4-triazol-5-amine SMR000144080 [5-amino-3-(3-pyridyl)-1,2,4-triazol-1-yl]-(p-tolyl)methanone | cid_970375
Type:
Small organic molecule
Emp. Form.:
C15H13N5O
Mol. Mass.:
279.2966
SMILES:
Cc1ccc(cc1)C(=O)n1nc(nc1N)-c1cccnc1
: