Target
Kallikrein-5
Ligand
BDBM32831
Substrate
Meas. Tech.
Kallikrein 5 1536 HTS Dose Response Confirmation
IC50
424.32±n/a nM
Citation
 PubChem, PC Kallikrein 5 1536 HTS Dose Response Confirmation PubChem Bioassay (2008)[AID] 
Target
Name:
Kallikrein-5
Synonyms:
KLK5 Kallikrein 5 kallikrein-related peptidase 5 preproprotein
Type:
PROTEIN
Mol. Mass.:
32031.72
Organism:
Homo sapiens (Human)
Description:
EBI_12584
Residue:
293
  
Inhibitor
Name:
BDBM32831
Synonyms:
(5-methylsulfanyl-3-phenyl-1,2,4-triazol-1-yl)-phenyl-methanone 1-benzoyl-3-phenyl-1H-1,2,4-triazol-5-ylmethylsulfide SMR000162940 [5-(methylthio)-3-phenyl-1,2,4-triazol-1-yl]-phenylmethanone | cid_5069358
Type:
Small organic molecule
Emp. Form.:
C16H13N3OS
Mol. Mass.:
295.359
SMILES:
CSc1nc(nn1C(=O)c1ccccc1)-c1ccccc1
: