Target
DNA repair protein RAD51 homolog 1
Ligand
BDBM56840
Substrate
Meas. Tech.
Homologous Recombination - Rad 51_Dose response
IC50
85000±n/a nM
Citation
 PubChem, PC Homologous Recombination - Rad 51_Dose response PubChem Bioassay (2008)[AID] 
Target
Name:
DNA repair protein RAD51 homolog 1
Synonyms:
RAD51 RAD51_HUMAN | RECA
Type:
Enzyme Catalytic Domain
Mol. Mass.:
36960.74
Organism:
Homo sapiens (Human)
Description:
gi_49168602
Residue:
339
  
Inhibitor
Name:
BDBM56840
Synonyms:
2-ethyl-2-methyl-3-oxidanyl-1H-quinazolin-4-one 2-ethyl-3-hydroxy-2-methyl-2,3-dihydroquinazolin-4(1H)-one SMR000024795 | cid_3236736
Type:
Small organic molecule
Emp. Form.:
C11H14N2O2
Mol. Mass.:
206.2411
SMILES:
CCC1(C)Nc2ccccc2C(=O)N1O
: