Target
DNA repair protein RAD51 homolog 1
Ligand
BDBM56858
Substrate
Meas. Tech.
Homologous Recombination - Rad 51_Dose response
IC50
85000±n/a nM
Citation
 PubChem, PC Homologous Recombination - Rad 51_Dose response PubChem Bioassay (2008)[AID] 
Target
Name:
DNA repair protein RAD51 homolog 1
Synonyms:
RAD51 RAD51_HUMAN | RECA
Type:
Enzyme Catalytic Domain
Mol. Mass.:
36960.74
Organism:
Homo sapiens (Human)
Description:
gi_49168602
Residue:
339
  
Inhibitor
Name:
BDBM56858
Synonyms:
1-(2-methylphenyl)-3-(2-oxolanylmethyl)urea 1-(Tetrahydro-furan-2-ylmethyl)-3-o-tolyl-urea MLS000528171 cid_2787273
Type:
Small organic molecule
Emp. Form.:
C13H18N2O2
Mol. Mass.:
234.2942
SMILES:
Cc1ccccc1NC(=O)NCC1CCCO1
: