Target
DNA repair protein RAD51 homolog 1
Ligand
BDBM56862
Substrate
Meas. Tech.
Homologous Recombination - Rad 51_Dose response
IC50
85000±n/a nM
Citation
 PubChem, PC Homologous Recombination - Rad 51_Dose response PubChem Bioassay (2008)[AID] 
Target
Name:
DNA repair protein RAD51 homolog 1
Synonyms:
RAD51 RAD51_HUMAN | RECA
Type:
Enzyme Catalytic Domain
Mol. Mass.:
36960.74
Organism:
Homo sapiens (Human)
Description:
gi_49168602
Residue:
339
  
Inhibitor
Name:
BDBM56862
Synonyms:
MLS000540335 N-(5-sulfanylidene-1,2,4-dithiazol-3-yl)propanamide SMR000125593 | cid_1489507
Type:
Small organic molecule
Emp. Form.:
C5H6N2OS3
Mol. Mass.:
206.309
SMILES:
CCC(=O)Nc1nc(=S)ss1
: