Target
Streptokinase A
Ligand
BDBM56967
Substrate
Meas. Tech.
Absorbance Microorganism-Based Dose Response HTS to Identify Inhibitors of Streptokinase Expression
EC50
66045±n/a nM
Citation
 PubChem, PC Absorbance Microorganism-Based Dose Response HTS to Identify Inhibitors of Streptokinase Expression PubChem Bioassay (2009)[AID] 
Target
Name:
Streptokinase A
Synonyms:
STRP_STRP1 streptokinase A precursor
Type:
Enzyme Catalytic Domain
Mol. Mass.:
49924.80
Organism:
Streptococcus pyogenes M1 GAS
Description:
gi_15675770
Residue:
440
  
Inhibitor
Name:
BDBM56967
Synonyms:
3-(1-adamantyl)-2-(1H-benzimidazol-2-yl)-3-keto-propionitrile 3-(1-adamantyl)-2-(1H-benzimidazol-2-yl)-3-oxopropanenitrile SMR000061090 | cid_3000038
Type:
Small organic molecule
Emp. Form.:
C20H21N3O
Mol. Mass.:
319.4002
SMILES:
[H]C12CC3([H])CC([H])(C1)CC(C2)(C3)C(=O)C(C#N)c1nc2ccccc2[nH]1
: