Target
Streptokinase A
Ligand
BDBM57621
Substrate
Meas. Tech.
Absorbance Microorganism-Based Dose Response HTS to Identify Inhibitors of Streptokinase Expression
EC50
150000±n/a nM
Citation
 PubChem, PC Absorbance Microorganism-Based Dose Response HTS to Identify Inhibitors of Streptokinase Expression PubChem Bioassay (2009)[AID] 
Target
Name:
Streptokinase A
Synonyms:
STRP_STRP1 streptokinase A precursor
Type:
Enzyme Catalytic Domain
Mol. Mass.:
49924.80
Organism:
Streptococcus pyogenes M1 GAS
Description:
gi_15675770
Residue:
440
  
Inhibitor
Name:
BDBM57621
Synonyms:
4-Methyl-benzoic acid [1H-benzo[cd]indol-(2E)-ylidene]-hydrazide N'-(2-benzo[cd]indolyl)-4-methylbenzohydrazide N'-benzo[cd]indol-2-yl-4-methylbenzohydrazide cid_919775
Type:
Small organic molecule
Emp. Form.:
C19H15N3O
Mol. Mass.:
301.3419
SMILES:
Cc1ccc(cc1)C(=O)NNC1=Nc2cccc3cccc1c23
: