Target
Streptokinase A
Ligand
BDBM57689
Substrate
Meas. Tech.
Absorbance Microorganism-Based Dose Response HTS to Identify Inhibitors of Streptokinase Expression
EC50
150000±n/a nM
Citation
 PubChem, PC Absorbance Microorganism-Based Dose Response HTS to Identify Inhibitors of Streptokinase Expression PubChem Bioassay (2009)[AID] 
Target
Name:
Streptokinase A
Synonyms:
STRP_STRP1 streptokinase A precursor
Type:
Enzyme Catalytic Domain
Mol. Mass.:
49924.80
Organism:
Streptococcus pyogenes M1 GAS
Description:
gi_15675770
Residue:
440
  
Inhibitor
Name:
BDBM57689
Synonyms:
4-(carbamoylamino)benzoic acid [2-(3-chloro-4-methylanilino)-2-oxo-1-phenylethyl] ester MLS000418020 [2-(3-chloro-4-methylanilino)-2-oxo-1-phenylethyl] 4-(carbamoylamino)benzoate cid_3977521
Type:
Small organic molecule
Emp. Form.:
C23H20ClN3O4
Mol. Mass.:
437.876
SMILES:
Cc1ccc(NC(=O)C(OC(=O)c2ccc(NC(N)=O)cc2)c2ccccc2)cc1Cl
: