Target
Streptokinase A
Ligand
BDBM58065
Substrate
Meas. Tech.
Absorbance Microorganism-Based Dose Response HTS to Identify Inhibitors of Streptokinase Expression
EC50
150000±n/a nM
Citation
 PubChem, PC Absorbance Microorganism-Based Dose Response HTS to Identify Inhibitors of Streptokinase Expression PubChem Bioassay (2009)[AID] 
Target
Name:
Streptokinase A
Synonyms:
STRP_STRP1 streptokinase A precursor
Type:
Enzyme Catalytic Domain
Mol. Mass.:
49924.80
Organism:
Streptococcus pyogenes M1 GAS
Description:
gi_15675770
Residue:
440
  
Inhibitor
Name:
BDBM58065
Synonyms:
(4E)-4-[[2-[2-(3,5-dimethylpyrazol-1-yl)-6-methyl-pyrimidin-4-yl]hydrazinyl]methylidene]-2-ethoxy-cyclohexa-2,5-dien-1-one (4E)-4-[[N'-[2-(3,5-dimethylpyrazol-1-yl)-6-methyl-pyrimidin-4-yl]hydrazino]methylene]-2-ethoxy-cyclohexa-2,5-dien-1-one 4-{[2-(3,5-Dimethyl-pyrazol-1-yl)-6-methyl-pyrimidin-4-yl]-hydrazonomethyl}-2-ethoxy-phenol SMR000413907 | cid_6525018
Type:
Small organic molecule
Emp. Form.:
C19H22N6O2
Mol. Mass.:
366.417
SMILES:
CCOc1cc(CN=Nc2cc(C)nc(n2)-n2nc(C)cc2C)ccc1O
: