Target
Streptokinase A
Ligand
BDBM58826
Substrate
Meas. Tech.
Absorbance Microorganism-Based Dose Response HTS to Identify Inhibitors of Streptokinase Expression
EC50
2592±n/a nM
Citation
 PubChem, PC Absorbance Microorganism-Based Dose Response HTS to Identify Inhibitors of Streptokinase Expression PubChem Bioassay (2009)[AID] 
Target
Name:
Streptokinase A
Synonyms:
STRP_STRP1 streptokinase A precursor
Type:
Enzyme Catalytic Domain
Mol. Mass.:
49924.80
Organism:
Streptococcus pyogenes M1 GAS
Description:
gi_15675770
Residue:
440
  
Inhibitor
Name:
BDBM58826
Synonyms:
MLS001234268 [4-(4,7-dimethyl-1,3-benzothiazol-2-yl)-1-piperazinyl]-(5-nitro-2-furanyl)methanone [4-(4,7-dimethyl-1,3-benzothiazol-2-yl)piperazino]-(5-nitro-2-furyl)methanone | cid_7292667
Type:
Small organic molecule
Emp. Form.:
C18H18N4O4S
Mol. Mass.:
386.425
SMILES:
Cc1ccc(C)c2sc(nc12)N1CCN(CC1)C(=O)c1ccc(o1)[N+]([O-])=O
: