Target
Cell division control protein 42 homolog
Ligand
BDBM54547
Substrate
Meas. Tech.
Oxadiazole SAR compounds tested by Multiplex dose response to identify specific small molecule inhibitors of Ras and Ras-related GTPases specifically Cdc42 activated mutant
EC50
2028±n/a nM
Citation
 PubChem, PC Oxadiazole SAR compounds tested by Multiplex dose response to identify specific small molecule inhibitors of Ras and Ras-related GTPases specifically Cdc42 activated mutant PubChem Bioassay (2009)[AID] 
Target
Name:
Cell division control protein 42 homolog
Synonyms:
CDC42 Cell division control protein 42 homolog cell division cycle 42 (GTP binding protein, 25kDa)
Type:
PROTEIN
Mol. Mass.:
21258.36
Organism:
Homo sapiens (Human)
Description:
ChEMBL_652970
Residue:
191
  
Inhibitor
Name:
BDBM54547
Synonyms:
1-[4-(2-chlorophenyl)-1-piperazinyl]-3-[3-(4-methoxyphenyl)-1,2,4-oxadiazol-5-yl]-1-propanone 1-[4-(2-chlorophenyl)piperazino]-3-[3-(4-methoxyphenyl)-1,2,4-oxadiazol-5-yl]propan-1-one UNM-0000306068 | cid_25241704
Type:
Small organic molecule
Emp. Form.:
C22H23ClN4O3
Mol. Mass.:
426.896
SMILES:
COc1ccc(cc1)-c1noc(CCC(=O)N2CCN(CC2)c2ccccc2Cl)n1
: