Target
Adenosine receptor A2a
Ligand
BDBM59208
Substrate
Meas. Tech.
Binding Assay
pH
7.4±0
Temperature
298.15±0 K
Ki
3470±430 nM
Citation
 Jacobson, KAOhno, MDuong, HTKim, SKTchilibon, SCesnek, MHolý, AGao, ZG A neoceptor approach to unraveling microscopic interactions between the human A2A adenosine receptor and its agonists. Chem Biol 12:237-47 (2005)  
Target
Name:
Adenosine receptor A2a
Synonyms:
A2A adenosine receptor (hA2A) ADENOSINE A2 ADORA2 Adenosine A2A receptor (A2AAR)
Type:
G Protein-Coupled Receptor (GPCR)
Mol. Mass.:
44716.46
Organism:
Homo sapiens (Human)
Description:
P29274
Residue:
412
  
Inhibitor
Name:
BDBM59208
Synonyms:
Adenosine analog, 13
Type:
Small organic molecule
Emp. Form.:
C20H24N6O4
Mol. Mass.:
412.4424
SMILES:
CCNC(=O)[C@H]1O[C@H]([C@H](O)[C@@H]1O)n1cnc2c(NCc3ccccc3C)ncnc12
: