Target
Replicase polyprotein 1ab
Ligand
BDBM59244
Substrate
Meas. Tech.
Inhibition Assay
pH
7.5±0
Ki
13.8±0.0 nM
Citation
 Wu, CYKing, KYKuo, CJFang, JMWu, YTHo, MYLiao, CLShie, JJLiang, PHWong, CH Stable benzotriazole esters as mechanism-based inactivators of the severe acute respiratory syndrome 3CL protease. Chem Biol 13:261-8 (2006)  
Target
Name:
Replicase polyprotein 1ab
Synonyms:
3C-like proteinase 3C-like proteinase (SARS-CoV 3Cpro) 3CLp GFL Guanine-N7 methyltransferase Helicase Leader protein Non-structural protein 10 Non-structural protein 3 Non-structural protein 6 Non-structural protein 8 ORF1ab polyprotein PL2-PRO Pol R1AB_SARS RdRp SARS coronavirus main proteinase nsp1 nsp12 nsp14 nsp16 nsp3 nsp5 nsp7 nsp9 pp1ab | rep
Type:
Protein
Mol. Mass.:
790250.81
Organism:
Human SARS coronavirus (SARS-CoV) (Severe acute respiratory syndrome coronavirus)
Description:
P0C6X7
Residue:
7073
  
Inhibitor
Name:
BDBM59244
Synonyms:
Benzotriazole ester, 10 | acs.jmedchem.1c00409_ST.11
Type:
Small organic molecule
Emp. Form.:
C15H9FN4O2
Mol. Mass.:
296.256
SMILES:
Fc1ccc2[nH]c(cc2c1)C(=O)On1nnc2ccccc12
: