Target
Alkaline phosphatase, germ cell type
Ligand
BDBM39635
Substrate
Meas. Tech.
Luminescent assay for HTS discovery of chemical activators of placental alkaline phosphatase
EC50
999000±n/a nM
Citation
 PubChem, PC Luminescent assay for HTS discovery of chemical activators of placental alkaline phosphatase PubChem Bioassay (2007)[AID] 
Target
Name:
Alkaline phosphatase, germ cell type
Synonyms:
ALPG ALPPL2 PPBN_HUMAN | placental-like alkaline phosphatase preproprotein
Type:
PROTEIN
Mol. Mass.:
57374.31
Organism:
Homo sapiens (Human)
Description:
ChEMBL_29964
Residue:
532
  
Inhibitor
Name:
BDBM39635
Synonyms:
MLS000112788 N-[4-(2-methylpiperidino)sulfonylphenyl]thiophene-2-carboxamide SMR000108697 | cid_2917457
Type:
Small organic molecule
Emp. Form.:
C17H20N2O3S2
Mol. Mass.:
364.482
SMILES:
CC1CCCCN1S(=O)(=O)c1ccc(NC(=O)c2cccs2)cc1
: