Target
Alkaline phosphatase, germ cell type
Ligand
BDBM32278
Substrate
Meas. Tech.
Luminescent assay for HTS discovery of chemical activators of placental alkaline phosphatase
EC50
37000±n/a nM
Citation
 PubChem, PC Luminescent assay for HTS discovery of chemical activators of placental alkaline phosphatase PubChem Bioassay (2007)[AID] 
Target
Name:
Alkaline phosphatase, germ cell type
Synonyms:
ALPG ALPPL2 PPBN_HUMAN | placental-like alkaline phosphatase preproprotein
Type:
PROTEIN
Mol. Mass.:
57374.31
Organism:
Homo sapiens (Human)
Description:
ChEMBL_29964
Residue:
532
  
Inhibitor
Name:
BDBM32278
Synonyms:
(6-anilino-2-pyridyl)-phenyl-amine MLS000534997 N2,N6-diphenylpyridine-2,6-diamine cid_1311254
Type:
Small organic molecule
Emp. Form.:
C17H15N3
Mol. Mass.:
261.3211
SMILES:
N(c1ccccc1)c1cccc(Nc2ccccc2)n1
: