Target
Alkaline phosphatase, tissue-nonspecific isozyme
Ligand
BDBM43811
Substrate
Meas. Tech.
uHTS identification of compounds activating TNAP in the absence of phosphate acceptor performed in luminescent assay
EC50
41702±n/a nM
Citation
 PubChem, PC uHTS identification of compounds activating TNAP in the absence of phosphate acceptor performed in luminescent assay PubChem Bioassay (2009)[AID] 
Target
Name:
Alkaline phosphatase, tissue-nonspecific isozyme
Synonyms:
ALPL tissue-nonspecific alkaline phosphatase precursor
Type:
PROTEIN
Mol. Mass.:
57306.17
Organism:
Homo sapiens (Human)
Description:
ChEMBL_1448917
Residue:
524
  
Inhibitor
Name:
BDBM43811
Synonyms:
1-[(4-chloranyl-1,5-dimethyl-pyrazol-3-yl)carbonylamino]-3-(4-methylphenyl)thiourea 1-[(4-chloro-1,5-dimethylpyrazole-3-carbonyl)amino]-3-(4-methylphenyl)thiourea MLS-0093499.0001 | cid_842689
Type:
Small organic molecule
Emp. Form.:
C14H16ClN5OS
Mol. Mass.:
337.828
SMILES:
Cc1c(Cl)c(nn1C)C(=O)NNC(=S)Nc1ccc(C)cc1
: