Target
Alkaline phosphatase, tissue-nonspecific isozyme
Ligand
BDBM59291
Substrate
Meas. Tech.
uHTS identification of compounds activating TNAP in the absence of phosphate acceptor performed in luminescent assay
EC50
61253±n/a nM
Citation
 PubChem, PC uHTS identification of compounds activating TNAP in the absence of phosphate acceptor performed in luminescent assay PubChem Bioassay (2009)[AID] 
Target
Name:
Alkaline phosphatase, tissue-nonspecific isozyme
Synonyms:
ALPL tissue-nonspecific alkaline phosphatase precursor
Type:
PROTEIN
Mol. Mass.:
57306.17
Organism:
Homo sapiens (Human)
Description:
ChEMBL_1448917
Residue:
524
  
Inhibitor
Name:
BDBM59291
Synonyms:
2,2'-(3-phenyl-1,2-butanediyl)bis-1H-benzimidazole 2-[1-(1H-benzimidazol-2-yl)-3-phenylbutan-2-yl]-1H-benzimidazole MLS000573149 cid_2837683
Type:
Small organic molecule
Emp. Form.:
C24H22N4
Mol. Mass.:
366.4583
SMILES:
CC(C(Cc1nc2ccccc2[nH]1)c1nc2ccccc2[nH]1)c1ccccc1
: