Target
Alkaline phosphatase, tissue-nonspecific isozyme
Ligand
BDBM59296
Substrate
Meas. Tech.
uHTS identification of compounds activating TNAP in the absence of phosphate acceptor performed in luminescent assay
EC50
100000±n/a nM
Citation
 PubChem, PC uHTS identification of compounds activating TNAP in the absence of phosphate acceptor performed in luminescent assay PubChem Bioassay (2009)[AID] 
Target
Name:
Alkaline phosphatase, tissue-nonspecific isozyme
Synonyms:
ALPL tissue-nonspecific alkaline phosphatase precursor
Type:
PROTEIN
Mol. Mass.:
57306.17
Organism:
Homo sapiens (Human)
Description:
ChEMBL_1448917
Residue:
524
  
Inhibitor
Name:
BDBM59296
Synonyms:
2-(6-benzimidazolo[1,2-c]quinazolinylthio)-N-(4-methoxyphenyl)acetamide 2-(benzimidazolo[1,2-c]quinazolin-6-ylsulfanyl)-N-(4-methoxyphenyl)acetamide 2-(benzimidazolo[1,2-c]quinazolin-6-ylthio)-N-(4-methoxyphenyl)acetamide SMR000206701 | cid_4329039
Type:
Small organic molecule
Emp. Form.:
C23H18N4O2S
Mol. Mass.:
414.48
SMILES:
COc1ccc(NC(=O)CSc2nc3ccccc3c3nc4ccccc4n23)cc1
: