Target
Alkaline phosphatase, tissue-nonspecific isozyme
Ligand
BDBM59311
Substrate
Meas. Tech.
uHTS identification of compounds activating TNAP in the absence of phosphate acceptor performed in luminescent assay
EC50
100000±n/a nM
Citation
 PubChem, PC uHTS identification of compounds activating TNAP in the absence of phosphate acceptor performed in luminescent assay PubChem Bioassay (2009)[AID] 
Target
Name:
Alkaline phosphatase, tissue-nonspecific isozyme
Synonyms:
ALPL tissue-nonspecific alkaline phosphatase precursor
Type:
PROTEIN
Mol. Mass.:
57306.17
Organism:
Homo sapiens (Human)
Description:
ChEMBL_1448917
Residue:
524
  
Inhibitor
Name:
BDBM59311
Synonyms:
2-[5-methyl-2-[(Z)-2-(methylthio)but-1-enyl]-1,3-benzothiazol-3-ium-3-yl]ethanol;methyl sulfate MLS000708044 cid_16189668
Type:
Small organic molecule
Emp. Form.:
C15H20NOS2
Mol. Mass.:
294.455
SMILES:
CC\C(SC)=C\c1sc2ccc(C)cc2[n+]1CCO
: